payment terms id
type: ObjectProperty
comment: added from BSP (per-class property assessment)
definition: The unique identifier of these trade payment terms.
domain includes: PaymentTerms
range includes: payment-terms-id
term status: proposed