Chemical Substance Concentration
type: Concept
broader: product-safety-and-quality
definition: Concentration of a specified regulated or restricted substance present in a product, in milligrams per kilogram.
in scheme: performance-metrics
notation: 09.07
scope note: EU REACH (SVHCs); EU RoHS Directive; EU ESPR Annex I; EU GPSR chemical safety requirements.
aggregation method: maximum
allowed unit: MK
improvement direction: lower