Land Use Change
type: Concept
broader: biodiversity-and-land-use
definition: Area of natural ecosystems converted to managed land for production or extraction activities, in hectares.
in scheme: performance-metrics
notation: 05.02
scope note: ESRS E4; GRI 304-1; GHG Protocol Land Sector Guidance.
aggregation method: sum
allowed unit: HAR
improvement direction: lower