Scope 1 GHG Emissions
type: Concept
broader: greenhouse-gas-emissions
definition: Absolute GHG emissions from sources owned or controlled by the reporting entity, in tonnes CO2 equivalent.
in scheme: performance-metrics
notation: 01.01
scope note: IFRS S2 para 29(a); ESRS E1-6; GRI 305-1; GHG Protocol Scope 1.
aggregation method: sum
allowed unit: TNE
improvement direction: lower