Total GHG Emissions
type: Concept
broader: greenhouse-gas-emissions
definition: Sum of Scope 1, Scope 2, and Scope 3 greenhouse gas emissions, in tonnes CO2 equivalent.
in scheme: performance-metrics
notation: 01.05
scope note: IFRS S2 para 29; ESRS E1-6; GRI 305.
aggregation method: sum
allowed unit: TNE
improvement direction: lower