Total Waste Generated
type: Concept
broader: waste-and-circularity
definition: Total weight of hazardous and non-hazardous waste generated by operations, in tonnes.
in scheme: performance-metrics
notation: 04.01
scope note: ESRS E5-5; GRI 306-3.
aggregation method: sum
allowed unit: TNE
improvement direction: lower