Veterinary Drug Residue Level
type: Concept
broader: food-safety-and-quality
definition: Concentration of a specified veterinary drug residue in animal-derived food, measured against the applicable maximum residue limit, in micrograms per kilogram.
in scheme: performance-metrics
notation: 10.04
scope note: Codex Maximum Residue Limits for Veterinary Drugs (CX/MRL); EU Regulation (EU) 37/2010.
aggregation method: maximum
allowed unit: MK
improvement direction: lower