postal address
type: ObjectProperty
domain includes: Party
domain includes: Facility
domain includes: Location
range includes: Address
definition: The postal address of a party, location or facility.
term status: proposed