postal address
type: ObjectProperty
definition: The postal address of a party, location or facility.
domain includes: Facility
domain includes: Location
domain includes: Party
range includes: Address
term status: proposed