preplanned indicator
type: DatatypeProperty
comment: added from BSP (per-class property assessment)
domain includes: Service
range includes: string
definition: The indication of whether or not this referenced transport service has been planned in advance of its execution.
term status: proposed