previous revision ID
type: DatatypeProperty
comment: re-added from BSP
definition: The identifier of the previous revision of this document.
domain includes: TradeDocument
range includes: string
term status: proposed