procedure type code
type: ObjectProperty
comment: code → WCO procedure scheme (Phase 3).
domain includes: RegulatoryProcedure
range includes: any-code
definition: The type of procedure (import, export, transit, warehousing, …).
term status: proposed