production process type code
type: ObjectProperty
comment: added from BSP (per-class property assessment)
definition: The code specifying the type of production process.
domain includes: ProductionProcess
range includes: any-code
term status: proposed