Active
type: Concept
definition: Product is in active service or use by the end customer or a downstream manufacturer. Equivalent to GS1 CBV Disp-retail_sold.
in scheme: product-status
notation: active