product category
type: ObjectProperty
comment: Open code list — typically HS, UNSPSC, or a sector product taxonomy, bound downstream.
definition: The classification category of the product.
domain includes: Product
range includes: any-code
term status: proposed