provider party
type: ObjectProperty
comment: added from BSP (per-class property assessment)
definition: The provider party for this monitoring IOT device.
domain includes: IOTDevice
range includes: Party
term status: proposed