public information
type: DatatypeProperty
definition: A URL to publicly available information about the registered identity.
domain includes: RegisteredIdentity
range includes: anyURI
term status: proposed