rate applicable percent
type: DatatypeProperty
comment: added from BSP (per-class property assessment)
domain includes: TradeTax
range includes: decimal
definition: The applicable rate, expressed as a percentage, for this trade tax, levy or duty.
term status: proposed