rate code
type: ObjectProperty
comment: added from BSP (per-class property assessment)
domain includes: TradeTax
range includes: any-code
definition: The code specifying the rate for this trade related tax, levy or duty.
term status: proposed