reason code
type: ObjectProperty
comment: added from BSP (per-class property assessment)
domain includes: Service
range includes: any-code
definition: A code specifying a reason for the declared error.
term status: proposed