recycling indicator
type: DatatypeProperty
comment: added from BSP (per-class property assessment)
definition: The indication of whether or not this is a recycling production process.
domain includes: ProductionProcess
range includes: string
term status: proposed