reference regulation
type: ObjectProperty
definition: A regulation the assessment or claim relates to.
domain includes: Claim
domain includes: ConformityAssessment
range includes: Regulation
term status: proposed