regime type
type: DatatypeProperty
comment: added from BSP (per-class property assessment)
domain includes: TradeTax
range includes: string
definition: The type of regime, expressed as text, applicable to the assessment or calculation of this trade related tax, levy or duty, such as a preferential duty rate.
term status: proposed