register type
type: ObjectProperty
comment: code → registry-type scheme.
domain includes: RegisteredIdentity
range includes: registry-type
definition: The type of register in which the identity is recorded.
term status: proposed