registration ID
type: ObjectProperty
definition: An official registration identifier of an organisation.
domain includes: Facility
domain includes: Organisation
domain includes: RegisteredIdentity
range includes: Identifier
term status: proposed