Accreditation
type: Concept
definition: A register of accredited conformity assessment bodies, maintained by a national or regional accreditation authority.
in scheme: registry-type
notation: accreditation