regulatory authority name
type: DatatypeProperty
comment: added from BSP (per-class property assessment)
definition: The name, expressed as text, for the regulatory authority for these transported dangerous goods.
domain includes: DangerousGoods
range includes: string
term status: proposed