related consignment
type: ObjectProperty
comment: restored from BSP (default-keep re-triage)
domain includes: Consignment
range includes: Consignment
definition: A consignment, at header level, related to this trade delivery.
term status: proposed