related specified location
type: ObjectProperty
comment: added from BSP (per-class property assessment)
definition: A related logistics location specified for this referenced transport service.
domain includes: Service
range includes: Location
term status: proposed