relevant location
type: ObjectProperty
comment: re-added from BSP
domain includes: DeliveryTerms
range includes: Location
definition: The location relevant for these delivery terms (the Incoterms named place).
term status: proposed