remaining battery charge percent
type: DatatypeProperty
comment: added from BSP (per-class property assessment)
definition: The percentage of the remaining battery charge of this monitoring IOT device.
domain includes: IOTDevice
range includes: decimal
term status: proposed