requester party
type: ObjectProperty
comment: added from BSP (per-class property assessment)
domain includes: Service
range includes: Party
definition: A trade party requesting this referenced transport service.
term status: proposed