responsible agency involvement code
type: ObjectProperty
comment: code → responsible-government-agency-involvement scheme (re-added from BSP).
domain includes: RegulatoryProcedure
range includes: responsible-government-agency-involvement-code-list
definition: A responsible agency involved in this cross-border regulatory procedure.
term status: proposed