responsible trade party
type: ObjectProperty
comment: added from BSP (per-class property assessment)
domain includes: Service
range includes: Party
definition: A party responsible for providing this referenced transport service.
term status: proposed