revision date time
type: DatatypeProperty
comment: re-added from BSP
definition: A date, time, date time or other date time value for the revision of this document.
domain includes: TradeDocument
range includes: dateTime
term status: proposed