role
type: ObjectProperty
comment: value → party-role scheme (semantic tokens). Qualifier on the party-role join node.
domain includes: PartyRole
range includes: party-role
definition: The role a party plays, relative to the referencing entity.
term status: proposed