Endorsed mandate
type: Concept
definition: Ownership of scheme or mandate for adoption of scheme by national government or intergovernmental entity.
in scheme: scheme-endorsement-level
notation: endorsed_mandate