seal condition
type: ObjectProperty
comment: code → seal-condition scheme.
definition: The condition of the seal (intact, broken, …).
domain includes: Seal
range includes: seal-condition-code-list
term status: proposed