seasonal applicable period
type: ObjectProperty
comment: added from BSP (per-class property assessment)
definition: A seasonal period applicable for this trade price.
domain includes: TradePrice
range includes: Period
term status: proposed