security level code
type: ObjectProperty
comment: added from BSP (per-class property assessment)
definition: A code specifying a security level for this transport route.
domain includes: TransportRoute
range includes: any-code
term status: proposed