settlement period measure
type: ObjectProperty
comment: added from BSP (per-class property assessment)
domain includes: PaymentTerms
range includes: Measure
definition: The measure of the number of settlement periods from this trade payment term time reference to the latest payment date, such as 30 days, 3 months.
term status: proposed