specified consignment
type: ObjectProperty
comment: reshaped from BSP specifiedLineTradeDelivery (line delivery → consignment).
domain includes: ConsignmentItem
range includes: Consignment
definition: The consignment specified for this consignment item.
term status: proposed