specified logistics location
type: ObjectProperty
comment: added from BSP (per-class property assessment)
domain includes: SupplyChainInventory
range includes: Location
definition: A location specified for this logistics status.
term status: proposed