specified payment means
type: ObjectProperty
comment: added from BSP (per-class property assessment)
definition: A payment means specified for this header trade settlement.
domain includes: ServiceCharge
range includes: PaymentMeans
term status: proposed