specified process
type: ObjectProperty
comment: added from BSP (default-keep re-triage)
domain includes: ProductBatch
range includes: ProductionProcess
definition: A production process specified for this product batch.
term status: proposed