specified supply plan
type: ObjectProperty
comment: added from BSP (default-keep re-triage)
definition: The specification of the delivery quantities and delivery date/time values in a supply plan for this trade product.
domain includes: Product
range includes: SupplyPlan
term status: proposed