specified trade party
type: ObjectProperty
comment: added from BSP (per-class property assessment)
domain includes: SupplyChainInventory
range includes: Party
definition: A party specified for this experience event.
term status: proposed