status
type: ObjectProperty
comment: code → criterion-status scheme.
domain includes: Criterion
domain includes: ConformityProfile
range includes: criterion-status
definition: The lifecycle status of a criterion or profile.
term status: proposed