status code
type: ObjectProperty
comment: added from BSP (per-class property assessment)
domain includes: ProductBatch
range includes: status-code-list
definition: A code specifying a status for this trade product.
term status: proposed