subject type
type: ObjectProperty
comment: code → assessment-subject-type scheme.
domain includes: ConformityProfile
range includes: assessment-subject-type
definition: The type of entity the profile assesses.
term status: proposed